{"text_format":"1","workbook":"xlsx","n_sheets":4,"sheets":["Selectie","Prijslijst","Bron","Validatie"],"not_rendered":{"charts":0,"images":13,"macros":1,"external_links":0,"defined_names":11,"comments":0,"pivot_tables":0},"unopened":[],"bounds":{"document_bytes":16777216,"sheet_cells":100000,"rows_first":2000,"rows_last":500,"rows_between":2000,"halvings":0,"cell_chars":16384,"cell_head_chars":4096},"cells_cut":0,"cells_raw":0,"read":"whole","date_system":"1900"}

{"sheet":"Selectie","index":0,"n_rows":999,"n_cols":5,"rows_kept":999,"cut":false,"hidden":false,"merged":[[3,4,3,20]]}
[null,{"$f":"IFERROR(LEFT(A1, SEARCH(\"/\",A1,1)-2),\"\")","v":""},{"$f":"IFERROR(INDEX(Bron!B:B,MATCH(Selectie!B1,Bron!C:C,0)),\"\")","v":""}]
[null,"",{"$f":"IFERROR(INDEX(Bron!B:B,MATCH(Selectie!B2,Bron!C:C,0)),\"\")","v":""}]
[null,"",{"$f":"IFERROR(INDEX(Bron!B:B,MATCH(Selectie!B3,Bron!C:C,0)),\"\")","v":""}]
[null,"",{"$f":"IFERROR(INDEX(Bron!B:B,MATCH(Selectie!B4,Bron!C:C,0)),\"\")","v":""},null,"Opstellen Prijslijst Materiaal en Techniek (Codes Nza)"]
[null,"",{"$f":"IFERROR(INDEX(Bron!B:B,MATCH(Selectie!B5,Bron!C:C,0)),\"\")","v":""}]
[null,"",{"$f":"IFERROR(INDEX(Bron!B:B,MATCH(Selectie!B6,Bron!C:C,0)),\"\")","v":""}]
[null,"",{"$f":"IFERROR(INDEX(Bron!B:B,MATCH(Selectie!B7,Bron!C:C,0)),\"\")","v":""}]
[null,"",{"$f":"IFERROR(INDEX(Bron!B:B,MATCH(Selectie!B8,Bron!C:C,0)),\"\")","v":""}]
[null,"",{"$f":"IFERROR(INDEX(Bron!B:B,MATCH(Selectie!B9,Bron!C:C,0)),\"\")","v":""}]
[null,"",{"$f":"IFERROR(INDEX(Bron!B:B,MATCH(Selectie!B10,Bron!C:C,0)),\"\")","v":""}]
[null,"",{"$f":"IFERROR(INDEX(Bron!B:B,MATCH(Selectie!B11,Bron!C:C,0)),\"\")","v":""}]
[null,"",{"$f":"IFERROR(INDEX(Bron!B:B,MATCH(Selectie!B12,Bron!C:C,0)),\"\")","v":""}]
[null,"",{"$f":"IFERROR(INDEX(Bron!B:B,MATCH(Selectie!B13,Bron!C:C,0)),\"\")","v":""}]
[null,"",{"$f":"IFERROR(INDEX(Bron!B:B,MATCH(Selectie!B14,Bron!C:C,0)),\"\")","v":""}]
[null,"",{"$f":"IFERROR(INDEX(Bron!B:B,MATCH(Selectie!B15,Bron!C:C,0)),\"\")","v":""}]
[null,"",{"$f":"IFERROR(INDEX(Bron!B:B,MATCH(Selectie!B16,Bron!C:C,0)),\"\")","v":""}]
[null,"",{"$f":"IFERROR(INDEX(Bron!B:B,MATCH(Selectie!B17,Bron!C:C,0)),\"\")","v":""}]
[null,"",{"$f":"IFERROR(INDEX(Bron!B:B,MATCH(Selectie!B18,Bron!C:C,0)),\"\")","v":""}]
[null,"",{"$f":"IFERROR(INDEX(Bron!B:B,MATCH(Selectie!B19,Bron!C:C,0)),\"\")","v":""}]
[null,"",{"$f":"IFERROR(INDEX(Bron!B:B,MATCH(Selectie!B20,Bron!C:C,0)),\"\")","v":""}]
[null,"",{"$f":"IFERROR(INDEX(Bron!B:B,MATCH(Selectie!B21,Bron!C:C,0)),\"\")","v":""}]
[null,"",{"$f":"IFERROR(INDEX(Bron!B:B,MATCH(Selectie!B22,Bron!C:C,0)),\"\")","v":""}]
[null,"",{"$f":"IFERROR(INDEX(Bron!B:B,MATCH(Selectie!B23,Bron!C:C,0)),\"\")","v":""}]
[null,"",{"$f":"IFERROR(INDEX(Bron!B:B,MATCH(Selectie!B24,Bron!C:C,0)),\"\")","v":""}]
[null,"",{"$f":"IFERROR(INDEX(Bron!B:B,MATCH(Selectie!B25,Bron!C:C,0)),\"\")","v":""}]
[null,"",{"$f":"IFERROR(INDEX(Bron!B:B,MATCH(Selectie!B26,Bron!C:C,0)),\"\")","v":""}]
[null,"",{"$f":"IFERROR(INDEX(Bron!B:B,MATCH(Selectie!B27,Bron!C:C,0)),\"\")","v":""}]
[null,"",{"$f":"IFERROR(INDEX(Bron!B:B,MATCH(Selectie!B28,Bron!C:C,0)),\"\")","v":""}]
[null,"",{"$f":"IFERROR(INDEX(Bron!B:B,MATCH(Selectie!B29,Bron!C:C,0)),\"\")","v":""}]
[null,"",{"$f":"IFERROR(INDEX(Bron!B:B,MATCH(Selectie!B30,Bron!C:C,0)),\"\")","v":""}]
[null,"",{"$f":"IFERROR(INDEX(Bron!B:B,MATCH(Selectie!B31,Bron!C:C,0)),\"\")","v":""}]
[null,"",{"$f":"IFERROR(INDEX(Bron!B:B,MATCH(Selectie!B32,Bron!C:C,0)),\"\")","v":""}]
[null,"",{"$f":"IFERROR(INDEX(Bron!B:B,MATCH(Selectie!B33,Bron!C:C,0)),\"\")","v":""}]
[null,"",{"$f":"IFERROR(INDEX(Bron!B:B,MATCH(Selectie!B34,Bron!C:C,0)),\"\")","v":""}]
[null,"",{"$f":"IFERROR(INDEX(Bron!B:B,MATCH(Selectie!B35,Bron!C:C,0)),\"\")","v":""}]
[null,"",{"$f":"IFERROR(INDEX(Bron!B:B,MATCH(Selectie!B36,Bron!C:C,0)),\"\")","v":""}]
[null,"",{"$f":"IFERROR(INDEX(Bron!B:B,MATCH(Selectie!B37,Bron!C:C,0)),\"\")","v":""}]
[null,"",{"$f":"IFERROR(INDEX(Bron!B:B,MATCH(Selectie!B38,Bron!C:C,0)),\"\")","v":""}]
[null,"",{"$f":"IFERROR(INDEX(Bron!B:B,MATCH(Selectie!B39,Bron!C:C,0)),\"\")","v":""}]
[null,"",{"$f":"IFERROR(INDEX(Bron!B:B,MATCH(Selectie!B40,Bron!C:C,0)),\"\")","v":""}]
[null,"",{"$f":"IFERROR(INDEX(Bron!B:B,MATCH(Selectie!B41,Bron!C:C,0)),\"\")","v":""}]
[null,"",{"$f":"IFERROR(INDEX(Bron!B:B,MATCH(Selectie!B42,Bron!C:C,0)),\"\")","v":""}]
[null,"",{"$f":"IFERROR(INDEX(Bron!B:B,MATCH(Selectie!B43,Bron!C:C,0)),\"\")","v":""}]
[null,"",{"$f":"IFERROR(INDEX(Bron!B:B,MATCH(Selectie!B44,Bron!C:C,0)),\"\")","v":""}]
[null,"",{"$f":"IFERROR(INDEX(Bron!B:B,MATCH(Selectie!B45,Bron!C:C,0)),\"\")","v":""}]
[null,"",{"$f":"IFERROR(INDEX(Bron!B:B,MATCH(Selectie!B46,Bron!C:C,0)),\"\")","v":""}]
[null,"",{"$f":"IFERROR(INDEX(Bron!B:B,MATCH(Selectie!B47,Bron!C:C,0)),\"\")","v":""}]
[null,"",{"$f":"IFERROR(INDEX(Bron!B:B,MATCH(Selectie!B48,Bron!C:C,0)),\"\")","v":""}]
[null,"",{"$f":"IFERROR(INDEX(Bron!B:B,MATCH(Selectie!B49,Bron!C:C,0)),\"\")","v":""}]
[null,"",{"$f":"IFERROR(INDEX(Bron!B:B,MATCH(Selectie!B50,Bron!C:C,0)),\"\")","v":""}]
[null,"",{"$f":"IFERROR(INDEX(Bron!B:B,MATCH(Selectie!B51,Bron!C:C,0)),\"\")","v":""}]
[null,"",{"$f":"IFERROR(INDEX(Bron!B:B,MATCH(Selectie!B52,Bron!C:C,0)),\"\")","v":""}]
[null,"",{"$f":"IFERROR(INDEX(Bron!B:B,MATCH(Selectie!B53,Bron!C:C,0)),\"\")","v":""}]
[null,"",{"$f":"IFERROR(INDEX(Bron!B:B,MATCH(Selectie!B54,Bron!C:C,0)),\"\")","v":""}]
[null,"",{"$f":"IFERROR(INDEX(Bron!B:B,MATCH(Selectie!B55,Bron!C:C,0)),\"\")","v":""}]
[null,"",{"$f":"IFERROR(INDEX(Bron!B:B,MATCH(Selectie!B56,Bron!C:C,0)),\"\")","v":""}]
[null,"",{"$f":"IFERROR(INDEX(Bron!B:B,MATCH(Selectie!B57,Bron!C:C,0)),\"\")","v":""}]
[null,"",{"$f":"IFERROR(INDEX(Bron!B:B,MATCH(Selectie!B58,Bron!C:C,0)),\"\")","v":""}]
[null,"",{"$f":"IFERROR(INDEX(Bron!B:B,MATCH(Selectie!B59,Bron!C:C,0)),\"\")","v":""}]
[null,"",{"$f":"IFERROR(INDEX(Bron!B:B,MATCH(Selectie!B60,Bron!C:C,0)),\"\")","v":""}]
{"$rows_left_out":940}
{"sheet":"Prijslijst","index":1,"n_rows":91,"n_cols":5,"rows_kept":91,"cut":false,"hidden":false,"merged":[[71,3,71,4],[16,3,16,4],[39,3,39,4],[52,3,52,4],[56,3,56,4],[63,3,63,4],[67,3,67,4]]}
[null,"Indicatie bijkomende materiaal- en techniekkosten tandheelkundige behandelingen"]
[]
[]
[null,"Ieder mens is uniek. En daarmee ook iedere tandheelkundige behandeling. Om daar zo goed mogelijk invulling aan te kunnen geven heeft de"]
[null,"Nederlandse Zorgautoriteit bepaald dat bij  bepaalde behandelingen materiaal- en techniekkosten additioneel in rekening moeten worden"]
[null,"gebracht. Hierdoor krijgt u als patiënt meer keuzemogelijkheden om die behandeling in te vullen."]
[]
[null,"Om u vooraf inzicht te geven in die mogelijkheden en de daarbij behorende prijsindicatie, hebben wij het volgende overzicht samengesteld."]
[null,"Om het overzichtelijk te houden hebben we de meest voorkomende behandelingen opgenomen. Indien er sprake is van een tandheelkundige "]
[null,"behandeling waarbij materiaal en/of techniekkosten in rekening worden gebracht en u heeft samen met uw behandelaar bepaald hoe deze"]
[null,"wordt ingevuld, dan krijgt u hiervoor een individuele prijsopgave of kunt u hierom vragen. Aan dit overzicht kunnen geen rechten worden"]
[null,"ontleend."]
[]
[null,"De meest voorkomende materiaal en/of techniekkosten in onze praktijk zijn:"]
[]
[]
[null,"Nza code en omschrijving","Omschrijving materiaal- en techniek","Prijsindicatie "]
[null,"VIII. Kronen en bruggen",null,"Van","Tot"]
[null,"R11 / Eenvlaksinlay","Techniekkosten inlay keramisch materiaal",220,450]
[null,null,"Techniekkosten inlay edelmetaal",220,450]
[null,"R12 / Tweevlaksinlay","Techniekkosten inlay",220,450]
[null,null,"Techniekkosten inlay edelmetaal",220,450]
[null,"R13 / Drievlaksinlay","Techniekkosten inlay",220,450]
[null,null,"Techniekkosten inlay edelmetaal",220,450]
[null,"R24 / Kroon","Techniekkosten composiet kroon",100]
[null,null,"Techniekkosten volledig keramische kroon",220,450]
[null,null,"Techniekkosten keramisch/porselein kroon",220,450]
[null,null,"Techniekkosten metaal/porselein kroon",220,450]
[null,null,"Techniekkosten goud/porselein kroon",220,450]
[null,null,"Techniekkosten vol gouden kroon",220,450]
[null,null,"Meerkosten verschroefbare kroon op implantaten",300,450]
[null,null,"Meerkosten gecementeerde kroon op implantaten",300,450]
[null,"R40, R45 / Brugtussendelen","Techniekkosten brugtussendeel keramisch",220,450]
[null,null,"Techniekkosten brugtussendeel metaal/porselein",220,450]
[null,null,"Techniekkosten brugtussendeel goud/porselein",220,450]
[null,"R60, R61 / Plakbrug","Techniekkosten etsbrug",350,450]
[null,"R78, R79 / Schildje van keramiek of kunststof","Techniekkosten keramische schildje",350,450]
[null,null,"Techniekkosten porseleinen schildje",350,450]
[]
[null,"Nza code en omschrijving","Omschrijving materiaal- en techniek","Prijsindicatie "]
[null,"XI. Kunstgebitten",null,"Van","Tot"]
[null,"P10 / Gedeeltelijk kunstgebit 1-4 elementen","Techniekkosten gedeeltelijk kunstgebit 1-4 elementen",150,250]
[null,"P15 / Gedeeltelijk kunstgebit 5-13 elementen","Techniekkosten gedeeltelijk kunstgebit 5-13 elementen",250,350]
[null,"P34 / Frame kunstgebit 1-4 elementen","Techniekkosten frame kunstgebit 1-4 elementen",450,550]
[null,"P35 / Frame kunstgebit 5-13 elementen","Techniekkosten frame kunstgebit 5-13 elementen",500,600]
[null,"P21, P25, P30 / Volledig kunstgebit","Techniekkosten kunstgebit bovenkaak",320,350]
[null,null,"Techniekkosten kunstgebit onderkaak",320,350]
[null,null,"Techniekkosten kunstgebit boven- en onderkaak",600,650]
[null,"P01, P02, P03, P04, P70 / Opvullen volledig kunstgebit","Techniekkosten opvullen kunstgebit",75,125]
[null,null,"Techniekkosten opvullen met weekblijvende basis"]
[null,"P07, P08 / Reparatie volledig kunstgebit","Techniekkosten reparatie volledig kunstgebit",35,150]
[]
[null,"Nza code en omschrijving","Omschrijving materiaal- en techniek","Prijsindicatie "]
[null,"III. Preventieve mondzorg",null,"Van","Tot"]
[null,"M61 / Mondbeschermer","Techniekkosten mondbeschermer",25,50]
[]
[null,"Nza code en omschrijving","Omschrijving materiaal- en techniek","Prijsindicatie "]
[null,"VII. Wortelkanaalbehandelingen",null,"Van","Tot"]
[null,"E97 / Uitwendig bleken per kaak","Kosten bleekhoes en materialen"]
[null,"E43 / Vastzetten element d.m.v. een spalk na ongeval","Techniekkosten spalk"]
{"$rows_left_out":32}
{"sheet":"Bron","index":2,"n_rows":594,"n_cols":8,"rows_kept":594,"cut":false,"hidden":false,"merged":[[0,5,0,6]]}
[null,null,"Code Nza","Omschrijving","Omschrijving materiaal- en techniek","Prijsindicatie ",null,"Nza code en omschrijving"]
[null,null,null,null,null,"Van","Tot"]
[{"$f":"IF(E3=\"\",1,\"\")","v":1},{"$f":"C3","v":"I. Consultatie en diagnostiek"},"I. Consultatie en diagnostiek"]
[{"$f":"IF(E4=\"\",1,\"\")","v":""},{"$f":"$B$3","v":"I. Consultatie en diagnostiek"},"C29","Studiemodellen t.b.v. behandelplan","Techniekkosten gebitsmodel",null,null,{"$f":"IF(D4=\"\",\"\",CONCATENATE(C4,\" / \",D4))","v":"C29 / Studiemodellen t.b.v. behandelplan"}]
[1,{"$f":"C5","v":"III. Preventieve mondzorg"},"III. Preventieve mondzorg",null,null,null,null,{"$f":"IF(D5=\"\",\"\",CONCATENATE(C5,\" / \",D5))","v":""}]
[{"$f":"IF(E6=\"\",1,\"\")","v":""},{"$f":"$B$5","v":"III. Preventieve mondzorg"},"M32","Eenvoudig bacteriologisch onderzoek","Laboratoriumkosten",null,null,{"$f":"IF(D6=\"\",\"\",CONCATENATE(C6,\" / \",D6))","v":"M32 / Eenvoudig bacteriologisch onderzoek"}]
["",{"$f":"$B$5","v":"III. Preventieve mondzorg"},null,null,"Materiaalkosten speekseltest",null,null,""]
["","III. Preventieve mondzorg","M61","Mondbeschermer","Techniekkosten mondbeschermer",null,null,"M61 / Mondbeschermer"]
[1,{"$f":"C9","v":"VI. Vullingen"},"VI. Vullingen",null,null,null,null,""]
["",{"$f":"$B$9","v":"VI. Vullingen"},"V70","Parapulpaire stift","Materiaalkosten parapulpaire stift",null,null,"V70 / Parapulpaire stift"]
["",{"$f":"$B$9","v":"VI. Vullingen"},"V80,V85","Wortelkanaalstift","Materiaalkosten wortelstift",null,null,"V80,V85 / Wortelkanaalstift"]
[1,{"$f":"C12","v":"VII. Wortelkanaalbehandelingen"},"VII. Wortelkanaalbehandelingen",null,null,null,null,{"$f":"IF(D12=\"\",\"\",CONCATENATE(C12,\" / \",D12))","v":""}]
["",{"$f":"$B$12","v":"VII. Wortelkanaalbehandelingen"},"E60","Geheel of gedeeltelijk weghalen van pulpaweefsel","Kosten biokeramisch materiaal (MTA)",null,null,{"$f":"IF(D13=\"\",\"\",CONCATENATE(C13,\" / \",D13))","v":"E60 / Geheel of gedeeltelijk weghalen van pulpaweefsel"}]
["",{"$f":"$B$12","v":"VII. Wortelkanaalbehandelingen"},"E63","Toeslag voor afsluiten met bijvoorbeeld MTA","Kosten biokeramisch materiaal (MTA)",null,null,"E63 / Toeslag voor afsluiten met bijvoorbeeld MTA"]
["","VII. Wortelkanaalbehandelingen","E97","Uitwendig bleken per kaak","Kosten bleekhoes en materialen",null,null,"E97 / Uitwendig bleken per kaak"]
["","VII. Wortelkanaalbehandelingen","E43","Vastzetten element d.m.v. een spalk na ongeval","Techniekkosten spalk",null,null,"E43 / Vastzetten element d.m.v. een spalk na ongeval"]
["","VII. Wortelkanaalbehandelingen","E34","Aanbrengen retrograde vulling","Materiaalkosten retrograde vulling",null,null,"E34 / Aanbrengen retrograde vulling"]
["","VII. Wortelkanaalbehandelingen","E36","Het trekken van een element met re-implantatie","Materiaalkosten bij re-implantatie element",null,null,{"$f":"IF(D18=\"\",\"\",CONCATENATE(C18,\" / \",D18))","v":"E36 / Het trekken van een element met re-implantatie"}]
[1,{"$f":"C19","v":"VIII. Kronen en bruggen"},"VIII. Kronen en bruggen",null,null,null,null,{"$f":"IF(D19=\"\",\"\",CONCATENATE(C19,\" / \",D19))","v":""}]
["",{"$f":"$B$19","v":"VIII. Kronen en bruggen"},"R08","Eenvlaks composiet inlay","Kosten composiet inlay",null,null,"R08 / Eenvlaks composiet inlay"]
["",{"$f":"$B$19","v":"VIII. Kronen en bruggen"},"R09","Tweevlaks composiet inlay","Kosten composiet inlay",null,null,"R09 / Tweevlaks composiet inlay"]
["","VIII. Kronen en bruggen","R10","Drievlaks composiet inlay","Kosten composiet inlay",null,null,"R10 / Drievlaks composiet inlay"]
["","VIII. Kronen en bruggen","R11","Eenvlaksinlay","Techniekkosten inlay keramisch materiaal",null,null,"R11 / Eenvlaksinlay"]
["","VIII. Kronen en bruggen",null,null,"Techniekkosten inlay edelmetaal",null,null,{"$f":"IF(D24=\"\",\"\",CONCATENATE(C24,\" / \",D24))","v":""}]
["","VIII. Kronen en bruggen","R12","Tweevlaksinlay","Techniekkosten inlay",null,null,"R12 / Tweevlaksinlay"]
["","VIII. Kronen en bruggen",null,null,"Techniekkosten inlay edelmetaal",null,null,""]
["","VIII. Kronen en bruggen","R13","Drievlaksinlay","Techniekkosten inlay",null,null,"R13 / Drievlaksinlay"]
["","VIII. Kronen en bruggen",null,null,"Techniekkosten inlay edelmetaal",null,null,""]
[{"$f":"IF(E29=\"\",1,\"\")","v":""},"VIII. Kronen en bruggen","R24","Kroon","Techniekkosten composiet kroon",null,null,{"$f":"IF(D29=\"\",\"\",CONCATENATE(C29,\" / \",D29))","v":"R24 / Kroon"}]
["","VIII. Kronen en bruggen",null,null,"Techniekkosten volledig keramische kroon",null,null,""]
["","VIII. Kronen en bruggen",null,null,"Techniekkosten keramisch/porselein kroon",null,null,""]
["","VIII. Kronen en bruggen",null,null,"Techniekkosten metaal/porselein kroon",null,null,{"$f":"IF(D32=\"\",\"\",CONCATENATE(C32,\" / \",D32))","v":""}]
["","VIII. Kronen en bruggen",null,null,"Techniekkosten goud/porselein kroon",null,null,""]
["","VIII. Kronen en bruggen",null,null,"Techniekkosten vol gouden kroon",null,null,""]
["","VIII. Kronen en bruggen",null,null,"Meerkosten verschroefbare kroon op implantaten",null,null,{"$f":"IF(D35=\"\",\"\",CONCATENATE(C35,\" / \",D35))","v":""}]
["","VIII. Kronen en bruggen",null,null,"Meerkosten gecementeerde kroon op implantaten",null,null,""]
["","VIII. Kronen en bruggen","J44","Plaatsen opbouw t.b.v. implantaatkroon","Materiaalkosten individueel abutment zirkonium",null,null,{"$f":"IF(D37=\"\",\"\",CONCATENATE(C37,\" / \",D37))","v":"J44 / Plaatsen opbouw t.b.v. implantaatkroon"}]
["","VIII. Kronen en bruggen",null,null,"Materiaalkosten individueel abutment titanium",null,null,{"$f":"IF(D38=\"\",\"\",CONCATENATE(C38,\" / \",D38))","v":""}]
["","VIII. Kronen en bruggen","R28","Endokroon","Techniekkosten endokroon",null,null,"R28 / Endokroon"]
["","VIII. Kronen en bruggen","R32","Gegoten opbouw, indirecte methode","Techniekkosten indirecte opbouw",null,null,"R32 / Gegoten opbouw, indirecte methode"]
["","VIII. Kronen en bruggen","R33","Gegoten opbouw, directe methode","Techniekkosten directe opbouw",null,null,"R33 / Gegoten opbouw, directe methode"]
["","VIII. Kronen en bruggen","R40, R45","Brugtussendelen","Techniekkosten brugtussendeel keramisch",null,null,"R40, R45 / Brugtussendelen"]
["","VIII. Kronen en bruggen",null,null,"Techniekkosten brugtussendeel metaal/porselein",null,null,""]
["","VIII. Kronen en bruggen",null,null,"Techniekkosten brugtussendeel goud/porselein",null,null,""]
["","VIII. Kronen en bruggen","R46","Brugverankering","Kosten brugverankering",null,null,{"$f":"IF(D45=\"\",\"\",CONCATENATE(C45,\" / \",D45))","v":"R46 / Brugverankering"}]
["","VIII. Kronen en bruggen","R50","Metalen fixatiekap met afdruk","Kosten metalen fixatiekap",null,null,"R50 / Metalen fixatiekap met afdruk"]
["","VIII. Kronen en bruggen","R55","Gipsslot met extra afdruk","Kosten gipsslot",null,null,"R55 / Gipsslot met extra afdruk"]
["","VIII. Kronen en bruggen","R60, R61","Plakbrug","Techniekkosten etsbrug",null,null,"R60, R61 / Plakbrug"]
["","VIII. Kronen en bruggen","R71","Vernieuwen porseleinen schildje","Techniekkosten keramische schildje",null,null,"R71 / Vernieuwen porseleinen schildje"]
["","VIII. Kronen en bruggen",null,null,"Techniekkosten porseleinen schildje",null,null,""]
["","VIII. Kronen en bruggen","R74","Opnieuw vastzetten niet plastische restauraties","Kosten opnieuw vastzetten restauratie",null,null,"R74 / Opnieuw vastzetten niet plastische restauraties"]
["","VIII. Kronen en bruggen","R78, R79","Schildje van keramiek of kunststof","Techniekkosten keramische schildje",null,null,{"$f":"IF(D52=\"\",\"\",CONCATENATE(C52,\" / \",D52))","v":"R78, R79 / Schildje van keramiek of kunststof"}]
["","VIII. Kronen en bruggen",null,null,"Techniekkosten porseleinen schildje",null,null,""]
["","VIII. Kronen en bruggen","R80, R85","Temporaire voorziening","Techniekkosten tijdelijke kroon",null,null,"R80, R85 / Temporaire voorziening"]
[1,{"$f":"C55","v":"IX. Kaakgewrichtsbehandelingen"},"IX. Kaakgewrichtsbehandelingen",null,null,null,null,""]
["",{"$f":"$B$55","v":"IX. Kaakgewrichtsbehandelingen"},"G62","Occlusale spalk","Techniekkosten occlusale spalk",null,null,"G62 / Occlusale spalk"]
["",{"$f":"$B$55","v":"IX. Kaakgewrichtsbehandelingen"},"G63","Repositiespalk","Techniekkosten repositiespalk",null,null,"G63 / Repositiespalk"]
["","IX. Kaakgewrichtsbehandelingen","G65","Indirect planmatig inslijpen","Techniekkosten planmatig inslijpen",null,null,"G65 / Indirect planmatig inslijpen"]
["","IX. Kaakgewrichtsbehandelingen","G33","Aanbrengen front/hoektandgeleiding","Techniekkosten front/hoektand geleiding",null,null,"G33 / Aanbrengen front/hoektandgeleiding"]
["","IX. Kaakgewrichtsbehandelingen","G69","Opbeetplaat","Techniekkosten opbeetplaat",null,null,{"$f":"IF(D60=\"\",\"\",CONCATENATE(C60,\" / \",D60))","v":"G69 / Opbeetplaat"}]
{"$rows_left_out":535}
{"sheet":"Validatie","index":3,"n_rows":28,"n_cols":15,"rows_kept":28,"cut":false,"hidden":false,"merged":[]}
["I. Consultatie en diagnostiek","III. Preventieve mondzorg","VI. Vullingen","VII. Wortelkanaalbehandelingen","VIII. Kronen en bruggen","IX. Kaakgewrichtsbehandelingen","XI. Kunstgebitten","XII. Tandvleesbehandelingen","XIII. Implantaten","XVI. Orthodontie",null,null,null,"Button lijst maken (aan = 1, uit = 0)","Praktijknaam"]
["C29 / Studiemodellen t.b.v. behandelplan","M32 / Eenvoudig bacteriologisch onderzoek","V70 / Parapulpaire stift","E60 / Geheel of gedeeltelijk weghalen van pulpaweefsel","R08 / Eenvlaks composiet inlay","G62 / Occlusale spalk","P10 / Gedeeltelijk kunstgebit 1-4 elementen","T84, T85 / Aanbrengen regeneratiemateriaal","J02 / Verlengd onderzoek implantologie","F125 / Maken gebitsmodellen",null,null,null,0]
[null,"M61 / Mondbeschermer","V80,V85 / Wortelkanaalstift","E63 / Toeslag voor afsluiten met bijvoorbeeld MTA","R09 / Tweevlaks composiet inlay","G63 / Repositiespalk","P15 / Gedeeltelijk kunstgebit 5-13 elementen","T93 / Bacteriologisch onderzoek","J03 / Proefopstelling","F131B / Vervaardigen diagnostische setup"]
[null,null,null,"E97 / Uitwendig bleken per kaak","R10 / Drievlaks composiet inlay","G65 / Indirect planmatig inslijpen","P34 / Frame kunstgebit 1-4 elementen","T57 / Toepassing lokaal medicament","J08 / Aanbrengen botvervangers","F132B / Extra gebitsmodellen tbv evaluatie"]
[null,null,null,"E43 / Vastzetten element d.m.v. een spalk na ongeval","R11 / Eenvlaksinlay","G33 / Aanbrengen front/hoektandgeleiding","P35 / Frame kunstgebit 5-13 elementen","T95 / (Draad)spalk","J09, J10 / Ophoging bodem bijholte","F401 / Plaatsen beugel categorie 0"]
[null,null,null,"E34 / Aanbrengen retrograde vulling","R12 / Tweevlaksinlay","G69 / Opbeetplaat","P31 / Wortelkap met stift",null,"J12, J13 / Kaakverbreding en/of verhoging in front","F411 / Plaatsen beugel categorie 1"]
[null,null,null,"E36 / Het trekken van een element met re-implantatie","R13 / Drievlaksinlay","G71 / Apparaat voor snurk en slaapstoornissen","P45 / Noodkunstgebit",null,"J15, J16 / Kaakverbreding en/of verhoging in front","F421 / Plaatsen beugel categorie 2"]
[null,null,null,null,"R24 / Kroon","G73 / Reparatie MRA","P21, P25, P30 / Volledig kunstgebit",null,"J17 / Aanvullende ophoging bodem","F431 / Plaatsen beugel categorie 3"]
[null,null,null,null,"J44 / Plaatsen opbouw t.b.v. implantaatkroon",null,"P01, P02, P03, P04, P70 / Opvullen volledig kunstgebit",null,"J18 / Ophoging bijholte orthograad","F441 / Plaatsen beugel categorie 4"]
[null,null,null,null,"R28 / Endokroon",null,"P51, P52, P53, P54 / Opvullen gedeeltelijk gebit",null,"J23, J24, J25 / Plaatsen healing abutment","F451 / Plaatsen beugel categorie 5"]
[null,null,null,null,"R32 / Gegoten opbouw, indirecte methode",null,"P07, P08 / Reparatie volledig kunstgebit",null,"J32 / Verwijderen gefractureerd abutment","F461 / Plaatsen beugel categorie 6"]
[null,null,null,null,"R33 / Gegoten opbouw, directe methode",null,"P57, P58 / Reparatie gedeeltelijk kunstgebit",null,"J40, J41 / Aanbrengen magneten/drukknoppen","F471 / Plaatsen beugel categorie 7"]
[null,null,null,null,"R40, R45 / Brugtussendelen",null,"P78, P79 / Uitbreiding gedeeltelijk kuntsgebit",null,"J42, 43 / Staaf ten behoeve van implantaten","F481 / Plaatsen beugel categorie 8"]
[null,null,null,null,"R46 / Brugverankering",null,null,null,"J50 / Volledig kunstgebit boven met onder klikgebit","F491 / Plaatsen beugel categorie 9"]
[null,null,null,null,"R50 / Metalen fixatiekap met afdruk",null,null,null,"J51 / Onder klikgebit","F611 / Elektronische chip in uitneembare apparatuur"]
[null,null,null,null,"R55 / Gipsslot met extra afdruk",null,null,null,"J52 / Boven klikgebit","F612 / Plaatsem intermaxillaire correctieveren"]
[null,null,null,null,"R60, R61 / Plakbrug",null,null,null,"J53 / Omvorming klikgebit","F716 / Mondbeschermer"]
[null,null,null,null,"R71 / Vernieuwen porseleinen schildje",null,null,null,"J54 / Omvorming klikgebit op 1 staaf","F723 / Plaatsen micro-implantaat"]
[null,null,null,null,"R74 / Opnieuw vastzetten niet plastische restauraties",null,null,null,"J55 / Omvorming klikgebit op staven bij drie / vier implantaten","F811 / Reparatie of vervanging beugel"]
[null,null,null,null,"R78, R79 / Schildje van keramiek of kunststof",null,null,null,"J56 / Omvorming klikgebit op staven bij vijf / zes implantaten","F812 / Herstel en plaatsen van retentie apparatuur"]
[null,null,null,null,"R80, R85 / Temporaire voorziening",null,null,null,"J70 / Opvullen zonder staafdemontage","F813, F814 / Plaatsen extra retentiebeugel, per kaak"]
[null,null,null,null,null,null,null,null,"J71 / Opvullen met staafdemontage op twee implantaten"]
[null,null,null,null,null,null,null,null,"J72 / Opvullen staafdemontage op twee staven"]
[null,null,null,null,null,null,null,null,"J73 / Opvullen met staafdemontage op meer dan twee staven"]
[null,null,null,null,null,null,null,null,"J74 / Reparatie zonder staafdemontage"]
[null,null,null,null,null,null,null,null,"J75 / Reparatie met staafdemontage "]
[null,null,null,null,null,null,null,null,"J76 / Reparatie met staafdemontage"]
[null,null,null,null,null,null,null,null,"J77 / Reparatie met staafdemontage"]